Target
Non-receptor tyrosine-protein kinase TYK2
Ligand
BDBM292111
Substrate
Meas. Tech.
LanthaScreen Biochemical Assay
Ki
0.55±n/a nM
Citation
 Fatheree, PRJacobsen, JRBrandt, GEBenjamin, NDabros, MThalladi, VR JAK kinase inhibitor compounds for treatment of respiratory disease US Patent  US10913740 Publication Date 2/9/2021 
Target
Name:
Non-receptor tyrosine-protein kinase TYK2
Synonyms:
Non-receptor tyrosine-protein kinase TYK2 (TYK2) TYK2_HUMAN | Tyrosine-protein kinase TYK2
Type:
Protein
Mol. Mass.:
133666.03
Organism:
Homo sapiens (Human)
Description:
P29597
Residue:
1187
  
Inhibitor
Name:
BDBM292111
Synonyms:
US10100049, Example 8 US10526330, Example 8 US11299492, Example 8 | US11718616, Example 8
Type:
Small organic molecule
Emp. Form.:
C28H33FN6O2
Mol. Mass.:
504.599
SMILES:
CCc1cc(O)c(F)cc1-c1ccc2c(n[nH]c2c1)-c1nc2CN(CCNC3CC(C3)OC)CCc2[nH]1
: