Target
Tyrosine-protein kinase JAK3
Ligand
BDBM292118
Substrate
Meas. Tech.
LanthaScreen Biochemical Assay
Ki
0.55±n/a nM
Citation
 Fatheree, PRJacobsen, JRBrandt, GEBenjamin, NDabros, MThalladi, VR JAK kinase inhibitor compounds for treatment of respiratory disease US Patent  US10913740 Publication Date 2/9/2021 
Target
Name:
Tyrosine-protein kinase JAK3
Synonyms:
JAK-3 JAK3_HUMAN Janus kinase 3 (JAK3) L-JAK | Leukocyte janus kinase
Type:
Protein
Mol. Mass.:
125111.08
Organism:
Homo sapiens (Human)
Description:
P52333
Residue:
1124
  
Inhibitor
Name:
BDBM292118
Synonyms:
US10100049, Example 15 US10526330, Example 15 US11299492, Example 15 | US11718616, Example 15
Type:
Small organic molecule
Emp. Form.:
C28H33FN6O
Mol. Mass.:
488.5996
SMILES:
CCc1cc(O)c(F)cc1-c1ccc2c(n[nH]c2c1)-c1nc2CN(CCN3CCC[C@@H]3C)CCc2[nH]1
: