Target
Tyrosine-protein kinase JAK2
Ligand
BDBM292105
Substrate
Meas. Tech.
LanthaScreen Biochemical Assay
Ki
<0.1±n/a nM
Citation
 Fatheree, PRJacobsen, JRBrandt, GEBenjamin, NDabros, MThalladi, VR JAK kinase inhibitor compounds for treatment of respiratory disease US Patent  US10913740 Publication Date 2/9/2021 
Target
Name:
Tyrosine-protein kinase JAK2
Synonyms:
JAK-2 JAK2_HUMAN Janus kinase 2 (JAK2) | Janus kinase 2 (a protein tyrosine kinase)
Type:
Protein
Mol. Mass.:
130684.68
Organism:
Homo sapiens (Human)
Description:
O60674
Residue:
1132
  
Inhibitor
Name:
BDBM292105
Synonyms:
US10100049, Example 2 US10526330, Example 2 US11299492, Example 2 | US11718616, Example 2
Type:
Small organic molecule
Emp. Form.:
C24H25FN6O
Mol. Mass.:
432.4933
SMILES:
CCc1cc(O)c(F)cc1-c1ccc2c(n[nH]c2c1)-c1nc2CN(CCc2[nH]1)C1CNC1
: