Target
Tyrosine-protein kinase JAK3
Ligand
BDBM292107
Substrate
Meas. Tech.
LanthaScreen Biochemical Assay
Ki
<0.1±n/a nM
Citation
 Fatheree, PRJacobsen, JRBrandt, GEBenjamin, NDabros, MThalladi, VR JAK kinase inhibitor compounds for treatment of respiratory disease US Patent  US10913740 Publication Date 2/9/2021 
Target
Name:
Tyrosine-protein kinase JAK3
Synonyms:
JAK-3 JAK3_HUMAN Janus kinase 3 (JAK3) L-JAK | Leukocyte janus kinase
Type:
Protein
Mol. Mass.:
125111.08
Organism:
Homo sapiens (Human)
Description:
P52333
Residue:
1124
  
Inhibitor
Name:
BDBM292107
Synonyms:
US10100049, Example 4 US10526330, Example 4 US11299492, Example 4 | US11718616, Example 4
Type:
Small organic molecule
Emp. Form.:
C28H33FN6O
Mol. Mass.:
488.5996
SMILES:
CCC(C)N1CC(C1)N1CCc2[nH]c(nc2C1)-c1n[nH]c2cc(ccc12)-c1cc(F)c(O)cc1CC
: