Target
Transient receptor potential cation channel subfamily A member 1
Ligand
BDBM481768
Substrate
Meas. Tech.
FLIPR Assay
IC50
86.0±n/a nM
Citation
 Chen, HShore, DVillemure, EVolgraf, MHu, BLu, ACridland, AWard, SBeaumier, FDery, MLarouche-Gauthier, R Oxadiazolones as transient receptor potential channel inhibitors US Patent  US10913742 Publication Date 2/9/2021 
Target
Name:
Transient receptor potential cation channel subfamily A member 1
Synonyms:
ANKTM1 TRPA1 Transformation-sensitive protein p120 | Transient receptor potential cation channel subfamily A member 1 (TRPA1)
Type:
Protein
Mol. Mass.:
127514.20
Organism:
Homo sapiens (Human)
Description:
O75762
Residue:
1119
  
Inhibitor
Name:
BDBM481768
Synonyms:
5-((7-methyl-6-oxo-6H- purin-1(7H)-yl)methyl)-3-(4- (trifluoromethoxy)phenethyl)- 1,3,4-oxadiazol-2(3H)-one | US10913742, Example 10
Type:
Small organic molecule
Emp. Form.:
C18H15F3N6O4
Mol. Mass.:
436.3447
SMILES:
Cn1cnc2ncn(Cc3nn(CCc4ccc(OC(F)(F)F)cc4)c(=O)o3)c(=O)c12
: