Target
Transient receptor potential cation channel subfamily A member 1
Ligand
BDBM481814
Substrate
Meas. Tech.
FLIPR Assay
IC50
168±n/a nM
Citation
 Chen, HShore, DVillemure, EVolgraf, MHu, BLu, ACridland, AWard, SBeaumier, FDery, MLarouche-Gauthier, R Oxadiazolones as transient receptor potential channel inhibitors US Patent  US10913742 Publication Date 2/9/2021 
Target
Name:
Transient receptor potential cation channel subfamily A member 1
Synonyms:
ANKTM1 TRPA1 Transformation-sensitive protein p120 | Transient receptor potential cation channel subfamily A member 1 (TRPA1)
Type:
Protein
Mol. Mass.:
127514.20
Organism:
Homo sapiens (Human)
Description:
O75762
Residue:
1119
  
Inhibitor
Name:
BDBM481814
Synonyms:
3-((4-(4-chlorophenethyl)-5- oxo-4,5-dihydro-1,3,4- oxadiazol-2-yl)methyl)-5- methyl-4-oxo-4,5-dihydro-3H- pyrrolo[3,2-d]pyrimidine-7- carbonitrile | US10913742, Example 56
Type:
Small organic molecule
Emp. Form.:
C19H15ClN6O3
Mol. Mass.:
410.814
SMILES:
Cn1cc(C#N)c2ncn(Cc3nn(CCc4ccc(Cl)cc4)c(=O)o3)c(=O)c12
: