Target
Transient receptor potential cation channel subfamily A member 1
Ligand
BDBM481833
Substrate
Meas. Tech.
FLIPR Assay
IC50
21.4±n/a nM
Citation
 Chen, HShore, DVillemure, EVolgraf, MHu, BLu, ACridland, AWard, SBeaumier, FDery, MLarouche-Gauthier, R Oxadiazolones as transient receptor potential channel inhibitors US Patent  US10913742 Publication Date 2/9/2021 
Target
Name:
Transient receptor potential cation channel subfamily A member 1
Synonyms:
ANKTM1 TRPA1 Transformation-sensitive protein p120 | Transient receptor potential cation channel subfamily A member 1 (TRPA1)
Type:
Protein
Mol. Mass.:
127514.20
Organism:
Homo sapiens (Human)
Description:
O75762
Residue:
1119
  
Inhibitor
Name:
BDBM481833
Synonyms:
4-[1-fluoro-3-[5-[(5-methyl-4- oxo-pyrido[2,3-d]pyrimidin-3- yl)methyl]-2-oxo-1,3,4- oxadiazol-3-yl]cyclobutyl] benzonitrile | US10913742, Example 77
Type:
Small organic molecule
Emp. Form.:
C22H17FN6O3
Mol. Mass.:
432.4072
SMILES:
Cc1ccnc2ncn(Cc3nn([C@H]4C[C@@](F)(C4)c4ccc(cc4)C#N)c(=O)o3)c(=O)c12
: