Target
Transient receptor potential cation channel subfamily A member 1
Ligand
BDBM481864
Substrate
Meas. Tech.
FLIPR Assay
IC50
19.1±n/a nM
Citation
 Chen, HShore, DVillemure, EVolgraf, MHu, BLu, ACridland, AWard, SBeaumier, FDery, MLarouche-Gauthier, R Oxadiazolones as transient receptor potential channel inhibitors US Patent  US10913742 Publication Date 2/9/2021 
Target
Name:
Transient receptor potential cation channel subfamily A member 1
Synonyms:
ANKTM1 TRPA1 Transformation-sensitive protein p120 | Transient receptor potential cation channel subfamily A member 1 (TRPA1)
Type:
Protein
Mol. Mass.:
127514.20
Organism:
Homo sapiens (Human)
Description:
O75762
Residue:
1119
  
Inhibitor
Name:
BDBM481864
Synonyms:
5-[(7-methyl-6-oxo-purin-1- yl)methyl]-3-[rac-(2R)-2- fluoro-2-[4- (trifluoromethoxy)phenyl]ethyl]- 1,3,4-oxadiazol-2-one | US10913742, Example 109
Type:
Small organic molecule
Emp. Form.:
C18H14F4N6O4
Mol. Mass.:
454.3352
SMILES:
Cn1cnc2ncn(Cc3nn(C[C@H](F)c4ccc(OC(F)(F)F)cc4)c(=O)o3)c(=O)c12
: