Target
Leucine-rich repeat serine/threonine-protein kinase 2 [1326-2527]
Ligand
BDBM481876
Substrate
Meas. Tech.
Enzyme Assay
IC50
2.40±n/a nM
Citation
 Gray, NSHatcher, JChoi, HG LRRK2 inhibitors and methods of making and using the same US Patent  US10913744 Publication Date 2/9/2021 
Target
Name:
Leucine-rich repeat serine/threonine-protein kinase 2 [1326-2527]
Synonyms:
GST-LRRK2 (aa 1326-2527) LRRK2_HUMAN | PARK8
Type:
Mol. Mass.:
136818.20
Organism:
Homo sapiens (Human)
Description:
Q5S007[1326-2527]
Residue:
1202
  
Inhibitor
Name:
BDBM481876
Synonyms:
US10913744, Compound 15
Type:
Small organic molecule
Emp. Form.:
C21H24N6O3
Mol. Mass.:
408.4537
SMILES:
COc1cc(ccc1Nc1nc(NC2CC2)c2cc[nH]c2n1)C(=O)N1CCOCC1
: