Target
Leucine-rich repeat serine/threonine-protein kinase 2 [1326-2527,G2019S]
Ligand
BDBM481879
Substrate
Meas. Tech.
Enzyme Assay
IC50
2.20±n/a nM
Citation
 Gray, NSHatcher, JChoi, HG LRRK2 inhibitors and methods of making and using the same US Patent  US10913744 Publication Date 2/9/2021 
Target
Name:
Leucine-rich repeat serine/threonine-protein kinase 2 [1326-2527,G2019S]
Synonyms:
GST-LRRK2 (aa 1326-2527,G2019S) LRRK2_HUMAN | PARK8
Type:
Mol. Mass.:
136848.23
Organism:
Homo sapiens (Human)
Description:
Q5S007[1326-2527,G2019S]
Residue:
1202
  
Inhibitor
Name:
BDBM481879
Synonyms:
(4-((5-chloro-4-(methylamino)-7H-pyrrolo[2,3-d]pyrimidin-2-yl) amino)-3-methoxyphenyl)(morpholino)methanone | US10913744, Compound 18
Type:
Small organic molecule
Emp. Form.:
C19H21ClN6O3
Mol. Mass.:
416.861
SMILES:
CNc1nc(Nc2ccc(cc2OC)C(=O)N2CCOCC2)nc2[nH]cc(Cl)c12
: