Target
Leucine-rich repeat serine/threonine-protein kinase 2 [1326-2527]
Ligand
BDBM481882
Substrate
Meas. Tech.
Enzyme Assay
IC50
35.0±n/a nM
Citation
 Gray, NSHatcher, JChoi, HG LRRK2 inhibitors and methods of making and using the same US Patent  US10913744 Publication Date 2/9/2021 
Target
Name:
Leucine-rich repeat serine/threonine-protein kinase 2 [1326-2527]
Synonyms:
GST-LRRK2 (aa 1326-2527) LRRK2_HUMAN | PARK8
Type:
Mol. Mass.:
136818.20
Organism:
Homo sapiens (Human)
Description:
Q5S007[1326-2527]
Residue:
1202
  
Inhibitor
Name:
BDBM481882
Synonyms:
US10913744, Compound 21
Type:
Small organic molecule
Emp. Form.:
C18H21N7O3
Mol. Mass.:
383.4044
SMILES:
CNc1nc(Nc2ccc(cc2OC)C(=O)N2CCOCC2)nc2[nH]cnc12
: