Target
Leucine-rich repeat serine/threonine-protein kinase 2 [1326-2527,A2016T]
Ligand
BDBM482157
Substrate
Meas. Tech.
Enzyme Assay
IC50
2450±n/a nM
Citation
 Gray, NSHatcher, JChoi, HG LRRK2 inhibitors and methods of making and using the same US Patent  US10913744 Publication Date 2/9/2021 
Target
Name:
Leucine-rich repeat serine/threonine-protein kinase 2 [1326-2527,A2016T]
Synonyms:
GST-LRRK2 (aa 1326-2527,A2016T) LRRK2_HUMAN | PARK8
Type:
Mol. Mass.:
136848.23
Organism:
Homo sapiens (Human)
Description:
Q5S007 (aa 1326-2527,A2016T)
Residue:
1202
  
Inhibitor
Name:
BDBM482157
Synonyms:
BDBM50379529 US11370796, Compound LRRK2-IN-1
Type:
Emp. Form.:
C31H38N8O3
Mol. Mass.:
570.6852
SMILES:
COc1cc(ccc1Nc1ncc2N(C)C(=O)c3ccccc3N(C)c2n1)C(=O)N1CCC(CC1)N1CCN(C)CC1
: