Target
Leucine-rich repeat serine/threonine-protein kinase 2 [1326-2527,A2016T]
Ligand
BDBM482158
Substrate
Meas. Tech.
Enzyme Assay
IC50
93.3±n/a nM
Citation
 Gray, NSHatcher, JChoi, HG LRRK2 inhibitors and methods of making and using the same US Patent  US10913744 Publication Date 2/9/2021 
Target
Name:
Leucine-rich repeat serine/threonine-protein kinase 2 [1326-2527,A2016T]
Synonyms:
GST-LRRK2 (aa 1326-2527,A2016T) LRRK2_HUMAN | PARK8
Type:
Mol. Mass.:
136848.23
Organism:
Homo sapiens (Human)
Description:
Q5S007 (aa 1326-2527,A2016T)
Residue:
1202
  
Inhibitor
Name:
BDBM482158
Synonyms:
BDBM50242742 | TAE684
Type:
Emp. Form.:
C30H40ClN7O3S
Mol. Mass.:
614.202
SMILES:
COc1cc(ccc1Nc1ncc(Cl)c(Nc2ccccc2S(=O)(=O)C(C)C)n1)N1CCC(CC1)N1CCN(C)CC1
: