Target
Leucine-rich repeat serine/threonine-protein kinase 2 [1326-2527,A2016T,G2019S]
Ligand
BDBM482159
Substrate
Meas. Tech.
Enzyme Assay
IC50
61.3±n/a nM
Citation
 Gray, NSHatcher, JChoi, HG LRRK2 inhibitors and methods of making and using the same US Patent  US10913744 Publication Date 2/9/2021 
Target
Name:
Leucine-rich repeat serine/threonine-protein kinase 2 [1326-2527,A2016T,G2019S]
Synonyms:
GST-LRRK2 (aa 1326-2527,A2016T,G2019S) LRRK2_HUMAN | PARK8
Type:
Mol. Mass.:
136878.26
Organism:
Homo sapiens (Human)
Description:
Q5S007 (aa 1326-2527,A2016T,G2019S)
Residue:
1202
  
Inhibitor
Name:
BDBM482159
Synonyms:
BDBM50401284 | GSK2578215A
Type:
Emp. Form.:
C24H18FN3O2
Mol. Mass.:
399.417
SMILES:
Fc1cc(ccn1)-c1ccc(OCc2ccccc2)c(c1)C(=O)Nc1cccnc1
: