Target
Ataxin-1
Ligand
BDBM481896
Substrate
Meas. Tech.
Enzyme Inhibition Assay
IC50
2.00±n/a nM
Citation
 Hert, JHunziker, DMattei, PMauser, HTang, GWang, L Octahydro-pyrrolo[3,4-c]-pyrrole derivatives and analogs thereof as autotaxin inhibitors US Patent  US10913745 Publication Date 2/9/2021 
Target
Name:
Ataxin-1
Synonyms:
ATX1 ATXN1 | SCA1
Type:
Protein
Mol. Mass.:
86941.25
Organism:
Homo sapiens (Human)
Description:
P54253
Residue:
815
  
Inhibitor
Name:
BDBM481896
Synonyms:
US10913745, Example 1.10
Type:
Small organic molecule
Emp. Form.:
C25H26F3N3O5S
Mol. Mass.:
537.551
SMILES:
NS(=O)(=O)c1ccc(cc1)C(=O)N1C[C@H]2CCN(CC[C@H]2C1)C(=O)\C=C\c1ccc(OC(F)(F)F)cc1
: