Target
Retinol-binding protein 4
Ligand
BDBM249484
Substrate
Meas. Tech.
Scintillation Proximity Binding Assay
IC50
11.6±n/a nM
Citation
 Petrukhin, KCioffi, CJohnson, GAllikmets, RFreeman, EChen, PConlon, MZhu, L Substituted 4-phenylpiperidines, their preparation and use US Patent  US10913746 Publication Date 2/9/2021 
Target
Name:
Retinol-binding protein 4
Synonyms:
PRBP RBP RET4_HUMAN Retinol-binding protein 4 (RBP4) | spa binding assay for rbp4
Type:
Protein
Mol. Mass.:
23008.75
Organism:
Homo sapiens (Human)
Description:
P02753
Residue:
201
  
Inhibitor
Name:
BDBM249484
Synonyms:
US10072016, Compound 82 US10913746, Compound 82 US9434727, 82 | US9777010, Compound 82
Type:
Small organic molecule
Emp. Form.:
C21H21F5N4O2
Mol. Mass.:
456.4091
SMILES:
CC(=O)N1CCc2[nH]nc(C(=O)N3CCC(CC3)c3ccc(F)c(F)c3C(F)(F)F)c2C1
: