Target
Retinol-binding protein 4
Ligand
BDBM249491
Substrate
Meas. Tech.
Scintillation Proximity Binding Assay
IC50
8.84±n/a nM
Citation
 Petrukhin, KCioffi, CJohnson, GAllikmets, RFreeman, EChen, PConlon, MZhu, L Substituted 4-phenylpiperidines, their preparation and use US Patent  US10913746 Publication Date 2/9/2021 
Target
Name:
Retinol-binding protein 4
Synonyms:
PRBP RBP RET4_HUMAN Retinol-binding protein 4 (RBP4) | spa binding assay for rbp4
Type:
Protein
Mol. Mass.:
23008.75
Organism:
Homo sapiens (Human)
Description:
P02753
Residue:
201
  
Inhibitor
Name:
BDBM249491
Synonyms:
US10072016, Compound 89 US10913746, Compound 89 US9434727, 89 | US9777010, Compound 89
Type:
Small organic molecule
Emp. Form.:
C22H23F5N4O2
Mol. Mass.:
470.4356
SMILES:
Fc1ccc(C2CCN(CC2)C(=O)c2n[nH]c3CCN(Cc23)C2COC2)c(c1F)C(F)(F)F
: