Target
Retinol-binding protein 4
Ligand
BDBM249518
Substrate
Meas. Tech.
Scintillation Proximity Binding Assay
IC50
11.4±n/a nM
Citation
 Petrukhin, KCioffi, CJohnson, GAllikmets, RFreeman, EChen, PConlon, MZhu, L Substituted 4-phenylpiperidines, their preparation and use US Patent  US10913746 Publication Date 2/9/2021 
Target
Name:
Retinol-binding protein 4
Synonyms:
PRBP RBP RET4_HUMAN Retinol-binding protein 4 (RBP4) | spa binding assay for rbp4
Type:
Protein
Mol. Mass.:
23008.75
Organism:
Homo sapiens (Human)
Description:
P02753
Residue:
201
  
Inhibitor
Name:
BDBM249518
Synonyms:
US10072016, Compound 116 US10913746, Compound 116 US9434727, 116 | US9777010, Compound 116
Type:
Small organic molecule
Emp. Form.:
C21H21F5N4O3
Mol. Mass.:
472.4085
SMILES:
COC(=O)N1CCc2c(C1)[nH]nc2C(=O)N1CCC(CC1)c1ccc(F)c(F)c1C(F)(F)F
: