Target
Retinol-binding protein 4
Ligand
BDBM249522
Substrate
Meas. Tech.
Scintillation Proximity Binding Assay
IC50
3.45±n/a nM
Citation
 Petrukhin, KCioffi, CJohnson, GAllikmets, RFreeman, EChen, PConlon, MZhu, L Substituted 4-phenylpiperidines, their preparation and use US Patent  US10913746 Publication Date 2/9/2021 
Target
Name:
Retinol-binding protein 4
Synonyms:
PRBP RBP RET4_HUMAN Retinol-binding protein 4 (RBP4) | spa binding assay for rbp4
Type:
Protein
Mol. Mass.:
23008.75
Organism:
Homo sapiens (Human)
Description:
P02753
Residue:
201
  
Inhibitor
Name:
BDBM249522
Synonyms:
US10072016, Compound 120 US10913746, Compound 120 US9434727, 120 | US9777010, Compound 120
Type:
Small organic molecule
Emp. Form.:
C20H18F5N5O
Mol. Mass.:
439.3818
SMILES:
Fc1ccc(C2CCN(CC2)C(=O)c2n[nH]c3CN(CCc23)C#N)c(c1F)C(F)(F)F
: