Target
Ubiquitin carboxyl-terminal hydrolase 25
Ligand
BDBM481935
Substrate
Meas. Tech.
Biochemical Assay
IC50
<200±n/a nM
Citation
 Guerin, DJBair, KWCaravella, JAIoannidis, Jr., SLancia, Jr., DRLi, HMischke, SNg, PYRichard, DSchiller, SEShelekhin, TWang, Z Thienopyridine carboxamides as ubiquitin-specific protease inhibitors US Patent  US10913753 Publication Date 2/9/2021 
Target
Name:
Ubiquitin carboxyl-terminal hydrolase 25
Synonyms:
3.4.19.12 UBP25_HUMAN USP21 Ubiquitin carboxyl-terminal hydrolase 25 Ubiquitin-specific-processing protease 25
Type:
PROTEIN
Mol. Mass.:
122185.70
Organism:
Homo sapiens
Description:
ChEMBL_118220
Residue:
1055
  
Inhibitor
Name:
BDBM481935
Synonyms:
US10913753, Compound I-2
Type:
Small organic molecule
Emp. Form.:
C22H27N5O2S
Mol. Mass.:
425.547
SMILES:
COc1cc(ccc1CCNC(=O)c1sc2nc(C)ccc2c1N)N1CCNCC1
: