Target
Ubiquitin carboxyl-terminal hydrolase 28
Ligand
BDBM481991
Substrate
Meas. Tech.
Biochemical Assay
IC50
<200±n/a nM
Citation
 Guerin, DJBair, KWCaravella, JAIoannidis, Jr., SLancia, Jr., DRLi, HMischke, SNg, PYRichard, DSchiller, SEShelekhin, TWang, Z Thienopyridine carboxamides as ubiquitin-specific protease inhibitors US Patent  US10913753 Publication Date 2/9/2021 
Target
Name:
Ubiquitin carboxyl-terminal hydrolase 28
Synonyms:
3.4.19.12 KIAA1515 USP28 Ubiquitin thioesterase 28 | Ubiquitin-specific-processing protease 28
Type:
PROTEIN
Mol. Mass.:
122456.92
Organism:
Homo sapiens
Description:
ChEMBL_105199
Residue:
1077
  
Inhibitor
Name:
BDBM481991
Synonyms:
US10913753, Compound I-58
Type:
Small organic molecule
Emp. Form.:
C22H25ClN4OS
Mol. Mass.:
428.978
SMILES:
CN1CCC(CC1)c1ccc(CCNC(=O)c2sc3nc(Cl)ccc3c2N)cc1
: