Target
Eukaryotic translation initiation factor 2-alpha kinase 3
Ligand
BDBM482168
Substrate
Meas. Tech.
Quantification of the Phosphorylated Product Formed from the Kinase Reaction in Presence of ATP
IC50
>160±n/a nM
Citation
 Bindi, SCarenzi, DMotto, IPulici, M N-(substituted-phenyl)-sulfonamide derivatives as kinase inhibitors US Patent  US10918642 Publication Date 2/16/2021 
Target
Name:
Eukaryotic translation initiation factor 2-alpha kinase 3
Synonyms:
E2AK3_HUMAN HsPEK PERK Pancreatic endoplasmic reticulum kinase (PERK)
Type:
Enzyme
Mol. Mass.:
125190.66
Organism:
Homo sapiens (Human)
Description:
Q9NZJ5
Residue:
1116
  
Inhibitor
Name:
BDBM482168
Synonyms:
4-{4-Amino-3-[3-(5-chloro-2-fluoro-4-methoxy-benzenesulfonylamino)-2-fluoro-phenyl]-pyrazolo[3,4-d]pyrimidin-1-yl}-piperidine-1-carboxylic acid tert-butyl ester US11491158, Cmpd 10
Type:
Small organic molecule
Emp. Form.:
C28H30ClF2N7O5S
Mol. Mass.:
650.097
SMILES:
COc1cc(F)c(cc1Cl)S(=O)(=O)Nc1cccc(-c2nn(C3CCN(CC3)C(=O)OC(C)(C)C)c3ncnc(N)c23)c1F
: