Target
Eukaryotic translation initiation factor 2-alpha kinase 3
Ligand
BDBM482199
Substrate
Meas. Tech.
ADP-Glo Kinase Assay
IC50
33±n/a nM
Citation
 Bindi, SCarenzi, DMotto, IPulici, M N-(substituted-phenyl)-sulfonamide derivatives as kinase inhibitors US Patent  US10918642 Publication Date 2/16/2021 
Target
Name:
Eukaryotic translation initiation factor 2-alpha kinase 3
Synonyms:
E2AK3_HUMAN HsPEK PERK Pancreatic endoplasmic reticulum kinase (PERK)
Type:
Enzyme
Mol. Mass.:
125190.66
Organism:
Homo sapiens (Human)
Description:
Q9NZJ5
Residue:
1116
  
Inhibitor
Name:
BDBM482199
Synonyms:
N-{3-[4-Amino-7-(1-ethyl-piperidin-4-yl)-7H-pyrrolo[2,3-d]pyrimidin-5-yl]-2-fluoro-phenyl}-4-methoxy-3-methyl-benzenesulfonamide US11491158, Cmpd 41
Type:
Small organic molecule
Emp. Form.:
C27H31FN6O3S
Mol. Mass.:
538.637
SMILES:
CCN1CCC(CC1)n1cc(-c2cccc(NS(=O)(=O)c3ccc(OC)c(C)c3)c2F)c2c(N)ncnc12
: