Target
Eukaryotic translation initiation factor 2-alpha kinase 3
Ligand
BDBM482221
Substrate
Meas. Tech.
ADP-Glo Kinase Assay
IC50
33±n/a nM
Citation
 Bindi, SCarenzi, DMotto, IPulici, M N-(substituted-phenyl)-sulfonamide derivatives as kinase inhibitors US Patent  US10918642 Publication Date 2/16/2021 
Target
Name:
Eukaryotic translation initiation factor 2-alpha kinase 3
Synonyms:
E2AK3_HUMAN HsPEK PERK Pancreatic endoplasmic reticulum kinase (PERK)
Type:
Enzyme
Mol. Mass.:
125190.66
Organism:
Homo sapiens (Human)
Description:
Q9NZJ5
Residue:
1116
  
Inhibitor
Name:
BDBM482221
Synonyms:
N-[3-(4-Amino-7-ethyl-7H-pyrrolo[2,3-d]pyrimidin-5-yl)-2-fluoro-phenyl]-5-chloro-2-fluoro-4-methoxy-benzenesulfonamide US11491158, Cmpd 75
Type:
Small organic molecule
Emp. Form.:
C21H18ClF2N5O3S
Mol. Mass.:
493.914
SMILES:
CCn1cc(-c2cccc(NS(=O)(=O)c3cc(Cl)c(OC)cc3F)c2F)c2c(N)ncnc12
: