Target
Eukaryotic translation initiation factor 2-alpha kinase 3
Ligand
BDBM482225
Substrate
Meas. Tech.
ADP-Glo Kinase Assay
IC50
105±n/a nM
Citation
 Bindi, SCarenzi, DMotto, IPulici, M N-(substituted-phenyl)-sulfonamide derivatives as kinase inhibitors US Patent  US10918642 Publication Date 2/16/2021 
Target
Name:
Eukaryotic translation initiation factor 2-alpha kinase 3
Synonyms:
E2AK3_HUMAN HsPEK PERK Pancreatic endoplasmic reticulum kinase (PERK)
Type:
Enzyme
Mol. Mass.:
125190.66
Organism:
Homo sapiens (Human)
Description:
Q9NZJ5
Residue:
1116
  
Inhibitor
Name:
BDBM482225
Synonyms:
6-Methoxy-pyridine-3-sulfonic acid [3-(4-amino-7-methyl-7H-pyrrolo[2,3-d]pyrimidin-5-yl)-2-fluoro-phenyl]-amide US11491158, Cmpd 81
Type:
Small organic molecule
Emp. Form.:
C19H17FN6O3S
Mol. Mass.:
428.44
SMILES:
COc1ccc(cn1)S(=O)(=O)Nc1cccc(-c2cn(C)c3ncnc(N)c23)c1F
: