Target
Hypoxia-inducible factor 1-alpha
Ligand
BDBM482297
Substrate
Meas. Tech.
HIF-1alpha transactivation assays
EC50
4000±n/a nM
Citation
 Muñoz Blanco, ENavarrete Rueda, CMCruz Teno, CBellido Cabello De Alba, ML Cannabidiol derivatives as inhibitors of the HIF prolyl hydroxylases activity US Patent  US10919843 Publication Date 2/16/2021 
Target
Name:
Hypoxia-inducible factor 1-alpha
Synonyms:
BHLHE78 HIF-1-alpha, HIF-2-alpha HIF1A_HUMAN Hypoxia-inducible factor 1 alpha MOP1 von Hippel-Lindau disease tumor suppressor/Elongin-C/Elongin-B/HIF1A
Type:
Protein
Mol. Mass.:
92647.24
Organism:
Homo sapiens (Human)
Description:
Q16665
Residue:
826
  
Inhibitor
Name:
BDBM482297
Synonyms:
US10919843, Compound VI
Type:
Small organic molecule
Emp. Form.:
C22H31NO3
Mol. Mass.:
357.4864
SMILES:
CCCCCC1=C(NC)C(=O)C([C@@H]2C=C(C)CC[C@H]2C(C)=C)=C(O)C1=O
: