Target
Histone deacetylase 1
Ligand
BDBM483364
Substrate
Meas. Tech.
Reporter Displacement Assay
Kd
25±n/a nM
Citation
 Jefson, MRLowe, III, JADey, FBergmann, ASchoop, AFuller, NO Hetero-halo inhibitors of histone deacetylase US Patent  US10919902 Publication Date 2/16/2021 
Target
Name:
Histone deacetylase 1
Synonyms:
Cereblon/Histone deacetylase 1 HDAC1 Histone deacetylase 1 (HDAC1) RPD3L1
Type:
Enzyme
Mol. Mass.:
55090.27
Organism:
Homo sapiens (Human)
Description:
Q13547
Residue:
482
  
Inhibitor
Name:
BDBM483364
Synonyms:
US10919902, Compound 108
Type:
Small organic molecule
Emp. Form.:
C15H17N5O
Mol. Mass.:
283.3284
SMILES:
Nc1cnc(cc1NC(=O)N1CCCC1)-c1ccncc1
: