Target
Histone deacetylase 2
Ligand
BDBM483369
Substrate
Meas. Tech.
Reporter Displacement Assay
Kd
275±n/a nM
Citation
 Jefson, MRLowe, III, JADey, FBergmann, ASchoop, AFuller, NO Hetero-halo inhibitors of histone deacetylase US Patent  US10919902 Publication Date 2/16/2021 
Target
Name:
Histone deacetylase 2
Synonyms:
Cereblon/Histone deacetylase 2 HDAC2 Histone deacetylase 2 (HDAC2) | Human HDAC2
Type:
Chromatin regulator; hydrolase; repressor
Mol. Mass.:
55356.54
Organism:
Homo sapiens (Human)
Description:
Q92769
Residue:
488
  
Inhibitor
Name:
BDBM483369
Synonyms:
US10919902, Compound 113
Type:
Small organic molecule
Emp. Form.:
C19H15F2N5O
Mol. Mass.:
367.3521
SMILES:
Nc1ccc(-c2ccc(F)cc2)c(F)c1NC(=O)N1Cc2nccnc2C1
: