Target
Histone deacetylase 1
Ligand
BDBM483370
Substrate
Meas. Tech.
Reporter Displacement Assay
Kd
65000±n/a nM
Citation
 Jefson, MRLowe, III, JADey, FBergmann, ASchoop, AFuller, NO Hetero-halo inhibitors of histone deacetylase US Patent  US10919902 Publication Date 2/16/2021 
Target
Name:
Histone deacetylase 1
Synonyms:
Cereblon/Histone deacetylase 1 HDAC1 Histone deacetylase 1 (HDAC1) RPD3L1
Type:
Enzyme
Mol. Mass.:
55090.27
Organism:
Homo sapiens (Human)
Description:
Q13547
Residue:
482
  
Inhibitor
Name:
BDBM483370
Synonyms:
US10919902, Compound 114
Type:
Small organic molecule
Emp. Form.:
C17H17F2N3O
Mol. Mass.:
317.3332
SMILES:
Nc1cc(F)c(cc1NC(=O)N1CCCC1)-c1ccc(F)cc1
: