Target
Histone deacetylase 2
Ligand
BDBM483377
Substrate
Meas. Tech.
Reporter Displacement Assay
Kd
65000±n/a nM
Citation
 Jefson, MRLowe, III, JADey, FBergmann, ASchoop, AFuller, NO Hetero-halo inhibitors of histone deacetylase US Patent  US10919902 Publication Date 2/16/2021 
Target
Name:
Histone deacetylase 2
Synonyms:
Cereblon/Histone deacetylase 2 HDAC2 Histone deacetylase 2 (HDAC2) | Human HDAC2
Type:
Chromatin regulator; hydrolase; repressor
Mol. Mass.:
55356.54
Organism:
Homo sapiens (Human)
Description:
Q92769
Residue:
488
  
Inhibitor
Name:
BDBM483377
Synonyms:
US10919902, Compound 121
Type:
Small organic molecule
Emp. Form.:
C17H14FN7O
Mol. Mass.:
351.3378
SMILES:
Nc1cnc(nc1NC(=O)N1Cc2nccnc2C1)-c1ccc(F)cc1
: