Target
Mitogen-activated protein kinase kinase kinase 5
Ligand
BDBM483389
Substrate
Meas. Tech.
RBC Kinase Assay Protocol
IC50
5.40±n/a nM
Citation
 Xu, YHalcomb, RKirschberg, TARomero, FA Tricyclic ASK1 inhibitors US Patent  US10919911 Publication Date 2/16/2021 
Target
Name:
Mitogen-activated protein kinase kinase kinase 5
Synonyms:
ASK1 MAP3K5 MEKK5
Type:
Protein
Mol. Mass.:
154514.93
Organism:
Homo sapiens (Human)
Description:
Q99683
Residue:
1374
  
Inhibitor
Name:
BDBM483389
Synonyms:
US10919911, Example 11
Type:
Small organic molecule
Emp. Form.:
C23H21N7O2
Mol. Mass.:
427.4585
SMILES:
C[C@@H]1COc2c(NC(=O)c3cc(ccn3)-n3cnc(c3)C3CC3)cccc2-c2nncn12
: