Target
Mitogen-activated protein kinase kinase kinase 5
Ligand
BDBM483453
Substrate
Meas. Tech.
RBC Kinase Assay Protocol
IC50
4.00±n/a nM
Citation
 Xu, YHalcomb, RKirschberg, TARomero, FA Tricyclic ASK1 inhibitors US Patent  US10919911 Publication Date 2/16/2021 
Target
Name:
Mitogen-activated protein kinase kinase kinase 5
Synonyms:
ASK1 MAP3K5 MEKK5
Type:
Protein
Mol. Mass.:
154514.93
Organism:
Homo sapiens (Human)
Description:
Q99683
Residue:
1374
  
Inhibitor
Name:
BDBM483453
Synonyms:
US10919911, Example 75
Type:
Small organic molecule
Emp. Form.:
C27H29N9O3
Mol. Mass.:
527.5777
SMILES:
C[C@@H]1CN(CCO1)c1cnc(cc1-n1cnc(c1)C1CC1)C(=O)Nc1cccc2-c3nnnn3[C@H](C)COc12
: