Target
E3 ubiquitin-protein ligase Mdm2
Ligand
BDBM374736
Substrate
Meas. Tech.
Mdm2-p53 Inhibition AlphaScreen
IC50
5.00±n/a nM
Citation
 Ramharter, JBroeker, JGille, AGollner, AHenry, MKerres, NWeinstabl, H Spiro[3H-indole-3,2′-pyrrolidin]-2(1H)-one compounds and derivatives as MDM2-p53 inhibitors US Patent  US10919913 Publication Date 2/16/2021 
Target
Name:
E3 ubiquitin-protein ligase Mdm2
Synonyms:
Double minute 2 protein E3 ubiquitin-protein ligase Mdm2 (p53-binding protein Mdm2) Human Double Minute 2 (HDM2) MDM2-MDMX p53-Binding Protein MDM2 | p53-binding protein
Type:
Oncoprotein
Mol. Mass.:
55196.54
Organism:
Homo sapiens (Human)
Description:
Q00987
Residue:
491
  
Inhibitor
Name:
BDBM374736
Synonyms:
US10246467, Example I-7 US10919913, # I-8
Type:
Small organic molecule
Emp. Form.:
C31H25Cl2FN4O5
Mol. Mass.:
623.458
SMILES:
COc1cc2c3OC[C@H]4[C@H]([C@H](c5cccc(Cl)c5F)[C@@]5(N4CC4CC4)C(=O)Nc4cc(Cl)ccc54)n3nc2cc1C(O)=O
: