Target
E3 ubiquitin-protein ligase Mdm2
Ligand
BDBM374753
Substrate
Meas. Tech.
Mdm2-p53 Inhibition AlphaScreen
IC50
12.0±n/a nM
Citation
 Ramharter, JBroeker, JGille, AGollner, AHenry, MKerres, NWeinstabl, H Spiro[3H-indole-3,2′-pyrrolidin]-2(1H)-one compounds and derivatives as MDM2-p53 inhibitors US Patent  US10919913 Publication Date 2/16/2021 
Target
Name:
E3 ubiquitin-protein ligase Mdm2
Synonyms:
Double minute 2 protein E3 ubiquitin-protein ligase Mdm2 (p53-binding protein Mdm2) Human Double Minute 2 (HDM2) MDM2-MDMX p53-Binding Protein MDM2 | p53-binding protein
Type:
Oncoprotein
Mol. Mass.:
55196.54
Organism:
Homo sapiens (Human)
Description:
Q00987
Residue:
491
  
Inhibitor
Name:
BDBM374753
Synonyms:
US10246467, Example I-36 US10919913, # I-37
Type:
Small organic molecule
Emp. Form.:
C30H25Cl2FN4O4
Mol. Mass.:
595.448
SMILES:
CC(C)CN1[C@H]2COc3n(nc4cc(ccc34)C(O)=O)[C@H]2[C@H](c2cccc(Cl)c2F)[C@]11C(=O)Nc2cc(Cl)ccc12
: