Target
Beta-1 adrenergic receptor
Ligand
BDBM483467
Substrate
Meas. Tech.
Ligand-Displacement Binding
Ki
33378000±9170000 nM
Citation
 Wainer, IWBernier, MToll, LRJimenez, LA Use of fenoterol and fenoterol analogues in the treatment of glioblastomas and astrocytomas US Patent  US10925840 Publication Date 2/23/2021 
Target
Name:
Beta-1 adrenergic receptor
Synonyms:
ADRB1 ADRB1_HUMAN Beta-1 adrenoceptor | adrenergic Beta1
Type:
G Protein-Coupled Receptor (GPCR)
Mol. Mass.:
51338.40
Organism:
Homo sapiens (Human)
Description:
P08588
Residue:
477
  
Inhibitor
Name:
BDBM483467
Synonyms:
US10925840, Compound (S,R)-2
Type:
Small organic molecule
Emp. Form.:
C19H24O4
Mol. Mass.:
316.3915
SMILES:
COc1ccc(C[C@@H](C)CC[C@@H](O)c2cc(O)cc(O)c2)cc1
: