Target
Beta-1 adrenergic receptor
Ligand
BDBM483478
Substrate
Meas. Tech.
Ligand-Displacement Binding
Ki
15791000±6269000 nM
Citation
 Wainer, IWBernier, MToll, LRJimenez, LA Use of fenoterol and fenoterol analogues in the treatment of glioblastomas and astrocytomas US Patent  US10925840 Publication Date 2/23/2021 
Target
Name:
Beta-1 adrenergic receptor
Synonyms:
ADRB1 ADRB1_HUMAN Beta-1 adrenoceptor | adrenergic Beta1
Type:
G Protein-Coupled Receptor (GPCR)
Mol. Mass.:
51338.40
Organism:
Homo sapiens (Human)
Description:
P08588
Residue:
477
  
Inhibitor
Name:
BDBM483478
Synonyms:
US10925840, Compound (R-S)-5
Type:
Small organic molecule
Emp. Form.:
C22H24O3
Mol. Mass.:
336.4242
SMILES:
C[C@H](CC[C@H](O)c1cc(O)cc(O)c1)Cc1cccc2ccccc12
: