Target
Beta-1 adrenergic receptor
Ligand
BDBM50213121
Substrate
Meas. Tech.
Ligand-Displacement Binding
Ki
52178000±3006000 nM
Citation
 Wainer, IWBernier, MToll, LRJimenez, LA Use of fenoterol and fenoterol analogues in the treatment of glioblastomas and astrocytomas US Patent  US10925840 Publication Date 2/23/2021 
Target
Name:
Beta-1 adrenergic receptor
Synonyms:
ADRB1 ADRB1_HUMAN Beta-1 adrenoceptor | adrenergic Beta1
Type:
G Protein-Coupled Receptor (GPCR)
Mol. Mass.:
51338.40
Organism:
Homo sapiens (Human)
Description:
P08588
Residue:
477
  
Inhibitor
Name:
BDBM50213121
Synonyms:
(S)-(+)-5-(1-hydroxy-2-phenethylaminoethyl)-1,3-benzenediol US10617654, Compound (S)-7 US9492405, (S)-7 | US9492405, 26
Type:
Small organic molecule
Emp. Form.:
C16H19NO3
Mol. Mass.:
273.327
SMILES:
O[C@H](CNCCc1ccccc1)c1cc(O)cc(O)c1
: