Target
Heat shock protein HSP 90-beta
Ligand
BDBM483492
Substrate
Meas. Tech.
Florescence Polarization Assay
Kd
23190±1070 nM
Citation
 Blagg, BSKent, CNKhandelwal, AMishra, SJ HSP90B N-terminal isoform-selective inhibitors US Patent  US10927076 Publication Date 2/23/2021 
Target
Name:
Heat shock protein HSP 90-beta
Synonyms:
HS90B_HUMAN HSP 90 HSP90B HSPCB Heat shock protein HSP 90 (Hsp90)
Type:
Molecular Chaperone
Mol. Mass.:
83229.45
Organism:
Homo sapiens (Human)
Description:
P08238
Residue:
724
  
Inhibitor
Name:
BDBM483492
Synonyms:
US10927076, Compound Table1A.7
Type:
Small organic molecule
Emp. Form.:
C20H24N2O2
Mol. Mass.:
324.4168
SMILES:
CNCc1cc(O)c(cc1C(C)C)C(=O)N1Cc2ccccc2C1
: