Target
Heat shock protein HSP 90-beta
Ligand
BDBM483497
Substrate
Meas. Tech.
Florescence Polarization Assay
Kd
2680±460 nM
Citation
 Blagg, BSKent, CNKhandelwal, AMishra, SJ HSP90B N-terminal isoform-selective inhibitors US Patent  US10927076 Publication Date 2/23/2021 
Target
Name:
Heat shock protein HSP 90-beta
Synonyms:
HS90B_HUMAN HSP 90 HSP90B HSPCB Heat shock protein HSP 90 (Hsp90)
Type:
Molecular Chaperone
Mol. Mass.:
83229.45
Organism:
Homo sapiens (Human)
Description:
P08238
Residue:
724
  
Inhibitor
Name:
BDBM483497
Synonyms:
US10927076, Compound Table1B.2
Type:
Small organic molecule
Emp. Form.:
C22H19NO4S
Mol. Mass.:
393.456
SMILES:
OCc1cc(O)c(cc1Sc1ccccc1O)C(=O)N1Cc2ccccc2C1
: