Target
Heat shock protein HSP 90-alpha
Ligand
BDBM483506
Substrate
Meas. Tech.
Florescence Polarization Assay
Kd
>100000±n/a nM
Citation
 Blagg, BSKent, CNKhandelwal, AMishra, SJ HSP90B N-terminal isoform-selective inhibitors US Patent  US10927076 Publication Date 2/23/2021 
Target
Name:
Heat shock protein HSP 90-alpha
Synonyms:
HS90A_HUMAN HSP86 HSP90AA1 HSPCA Heat shock 86 kDa Heat shock protein HSP 90-alpha (HSP90) LAP-2 Lipopolysaccharide-associated protein 2 heat shock protein 90kDa alpha (cytosolic), class A member 1 isoform 2
Type:
Molecular Chaperone
Mol. Mass.:
84623.45
Organism:
Homo sapiens (Human)
Description:
P07900
Residue:
732
  
Inhibitor
Name:
BDBM483506
Synonyms:
US10927076, Compound Table2.NH(CH2CH3)
Type:
Small organic molecule
Emp. Form.:
C20H24N2O2
Mol. Mass.:
324.4168
SMILES:
CCNc1cc(O)c(cc1C(C)C)C(=O)N1Cc2ccccc2C1
: