Target
Heat shock protein HSP 90-beta
Ligand
BDBM483523
Substrate
Meas. Tech.
Florescence Polarization Assay
Kd
4270±n/a nM
Citation
 Blagg, BSKent, CNKhandelwal, AMishra, SJ HSP90B N-terminal isoform-selective inhibitors US Patent  US10927076 Publication Date 2/23/2021 
Target
Name:
Heat shock protein HSP 90-beta
Synonyms:
HS90B_HUMAN HSP 90 HSP90B HSPCB Heat shock protein HSP 90 (Hsp90)
Type:
Molecular Chaperone
Mol. Mass.:
83229.45
Organism:
Homo sapiens (Human)
Description:
P08238
Residue:
724
  
Inhibitor
Name:
BDBM483523
Synonyms:
US10927076, Compound KUNB14
Type:
Small organic molecule
Emp. Form.:
C19H21NO4
Mol. Mass.:
327.3743
SMILES:
CC(C)c1cc(C(=O)N2Cc3ccccc3C2)c(O)c(CO)c1O
: