Target
Heat shock protein HSP 90-alpha
Ligand
BDBM483531
Substrate
Meas. Tech.
Florescence Polarization Assay
Kd
>10000±n/a nM
Citation
 Blagg, BSKent, CNKhandelwal, AMishra, SJ HSP90B N-terminal isoform-selective inhibitors US Patent  US10927076 Publication Date 2/23/2021 
Target
Name:
Heat shock protein HSP 90-alpha
Synonyms:
HS90A_HUMAN HSP86 HSP90AA1 HSPCA Heat shock 86 kDa Heat shock protein HSP 90-alpha (HSP90) LAP-2 Lipopolysaccharide-associated protein 2 heat shock protein 90kDa alpha (cytosolic), class A member 1 isoform 2
Type:
Molecular Chaperone
Mol. Mass.:
84623.45
Organism:
Homo sapiens (Human)
Description:
P07900
Residue:
732
  
Inhibitor
Name:
BDBM483531
Synonyms:
US10927076, Compound KUNB23
Type:
Small organic molecule
Emp. Form.:
C23H25NO3
Mol. Mass.:
363.4495
SMILES:
CCC1Cc2c(C1=O)c(O)c(cc2C(C)C)C(=O)N1Cc2ccccc2C1
: