Target
Heat shock protein HSP 90-beta
Ligand
BDBM483534
Substrate
Meas. Tech.
Florescence Polarization Assay
Kd
530±n/a nM
Citation
 Blagg, BSKent, CNKhandelwal, AMishra, SJ HSP90B N-terminal isoform-selective inhibitors US Patent  US10927076 Publication Date 2/23/2021 
Target
Name:
Heat shock protein HSP 90-beta
Synonyms:
HS90B_HUMAN HSP 90 HSP90B HSPCB Heat shock protein HSP 90 (Hsp90)
Type:
Molecular Chaperone
Mol. Mass.:
83229.45
Organism:
Homo sapiens (Human)
Description:
P08238
Residue:
724
  
Inhibitor
Name:
BDBM483534
Synonyms:
US10927076, Compound KUNB26
Type:
Small organic molecule
Emp. Form.:
C22H24N2O3
Mol. Mass.:
364.4376
SMILES:
CCN1Cc2c(C1=O)c(O)c(cc2C(C)C)C(=O)N1Cc2ccccc2C1
: