Target
High affinity nerve growth factor receptor
Ligand
BDBM412334
Substrate
Meas. Tech.
Pharmacological Assay
IC50
0.55±n/a nM
Citation
 Kawada, Y Intermediate compound of novel tetrahydronaphthyl urea derivative US Patent  US10927079 Publication Date 2/23/2021 
Target
Name:
High affinity nerve growth factor receptor
Synonyms:
2.7.10.1 NTRK1 NTRK1_HUMAN Neurotrophic tyrosine kinase receptor type 1 Synonyms=MTC TRK1-transforming tyrosine kinase protein TRKA GN Tropomyosin alpha-3 chain/High affinity nerve growth factor receptor Tropomyosin-related kinase A (TrkA) Tyrosine kinase receptor (Trk) Tyrosine kinase receptor A (Trk A) Tyrosine kinase receptor A (TrkA) p140-TrkA
Type:
Mol. Mass.:
87498.18
Organism:
Homo sapiens (Human)
Description:
P04629
Residue:
796
  
Inhibitor
Name:
BDBM412334
Synonyms:
US10399945, Example 61b US10927079, Compound 61a
Type:
Small organic molecule
Emp. Form.:
C27H31F2N5O3
Mol. Mass.:
511.5635
SMILES:
Cc1cc(NC(=O)N[C@H]2[C@H](O)CC(C)(C)c3cc(F)c(F)cc23)c(nc1-c1cn[nH]c1)C1CCOCC1
: