Target
Indoleamine 2,3-dioxygenase 1
Ligand
BDBM483559
Substrate
Meas. Tech.
Enzyme Assay
IC50
178±n/a nM
Citation
 Liu, KClausen, DGuo, LHan, YHe, SKozlowski, JLi, DPu, QYu, WZhang, H Substituted sulfoximine compounds as indoleamine 2,3-dioxygenase (IDO) inhibitors US Patent  US10927086 Publication Date 2/23/2021 
Target
Name:
Indoleamine 2,3-dioxygenase 1
Synonyms:
I23O1_HUMAN IDO-1 INDO Indoleamine 2,3-dioxygenase | Indoleamine-pyrrole 2,3-dioxygenase
Type:
Enzyme
Mol. Mass.:
45330.80
Organism:
Homo sapiens (Human)
Description:
P14902
Residue:
403
  
Inhibitor
Name:
BDBM483559
Synonyms:
N-((S)-4-fluorobicyclo[4.2.0]octa- 1(6),2,4-trien-7-yl)-N''-hydroxy-4-(4-(S- methylsulfonimidoyl)butoxy)-1,2,5- oxadiazole-3-carboximidamide (chiral, isomer 1) US10927086, Example 33
Type:
Small organic molecule
Emp. Form.:
C16H20FN5O4S
Mol. Mass.:
397.425
SMILES:
CS(=N)(=O)CCCCOc1nonc1\C(N[C@H]1Cc2ccc(F)cc12)=N\O
: