Target
Indoleamine 2,3-dioxygenase 1
Ligand
BDBM483569
Substrate
Meas. Tech.
Enzyme Assay
IC50
56.8±n/a nM
Citation
 Liu, KClausen, DGuo, LHan, YHe, SKozlowski, JLi, DPu, QYu, WZhang, H Substituted sulfoximine compounds as indoleamine 2,3-dioxygenase (IDO) inhibitors US Patent  US10927086 Publication Date 2/23/2021 
Target
Name:
Indoleamine 2,3-dioxygenase 1
Synonyms:
I23O1_HUMAN IDO-1 INDO Indoleamine 2,3-dioxygenase | Indoleamine-pyrrole 2,3-dioxygenase
Type:
Enzyme
Mol. Mass.:
45330.80
Organism:
Homo sapiens (Human)
Description:
P14902
Residue:
403
  
Inhibitor
Name:
BDBM483569
Synonyms:
N-[(7S)-4-fluorobicyclo[4.2.0]octa-1,3,5- trien-7-yl]-N''-hydroxy-4-{[1-(S- methylsulfonimidoyl)azetidin-3-yl]oxy}- 1,2,5-oxadiazole-3-carboximidamide (isomer 1) US10927086, Example 42
Type:
Small organic molecule
Emp. Form.:
C15H17FN6O4S
Mol. Mass.:
396.397
SMILES:
CS(=N)(=O)N1CC(C1)Oc1nonc1\C(N[C@H]1Cc2ccc(F)cc12)=N\O
: