Target
Monoglyceride lipase
Ligand
BDBM483662
Substrate
Meas. Tech.
In Vitro Competitive Activity-Based Protein Profiling
IC50
<100±n/a nM
Citation
 Grice, CAWiener, JJWeber, ODDuncan, KK Pyrazole MAGL inhibitors US Patent  US10927105 Publication Date 2/23/2021 
Target
Name:
Monoglyceride lipase
Synonyms:
HU-K5 Lysophospholipase-like MGL MGLL_HUMAN
Type:
Hydrolase
Mol. Mass.:
33264.56
Organism:
Homo sapiens (Human)
Description:
Human recombinant MGL (Cayman Chemical, cat# 10008354).
Residue:
303
  
Inhibitor
Name:
BDBM483662
Synonyms:
1-(trans-5-((3- chloro-5- fluorobenzyl)oxy)- octahydrocyclopenta- [c]pyrrole-2- carbonyl)-1H- pyrazole-3- carboxylic acid US11655217, Example 53
Type:
Small organic molecule
Emp. Form.:
C19H19ClFN3O4
Mol. Mass.:
407.823
SMILES:
OC(=O)c1ccn(n1)C(=O)N1C[C@@H]2C[C@H](C[C@@H]2C1)OCc1cc(F)cc(Cl)c1
: