Target
Fatty acid 2-hydroxylase
Ligand
BDBM483704
Substrate
Meas. Tech.
In Vitro Competitive Activity-Based Protein Profiling
IC50
550±n/a nM
Citation
 Grice, CAWiener, JJWeber, ODDuncan, KK Pyrazole MAGL inhibitors US Patent  US10927105 Publication Date 2/23/2021 
Target
Name:
Fatty acid 2-hydroxylase
Synonyms:
FA2H FAAH Fatty acid alpha-hydroxylase | Fatty acid hydroxylase domain-containing protein 1
Type:
Protein
Mol. Mass.:
42806.38
Organism:
Human
Description:
Q7L5A8
Residue:
372
  
Inhibitor
Name:
BDBM483704
Synonyms:
1-(2-(3,5- dichlorobenzyl)-2,8- diazaspiro[4.5]- decane-8- carbonyl)-1H- pyrazole-3- carboxylic acid US11655217, Example 162
Type:
Small organic molecule
Emp. Form.:
C20H22Cl2N4O3
Mol. Mass.:
437.32
SMILES:
OC(=O)c1ccn(n1)C(=O)N1CCC2(CCN(Cc3cc(Cl)cc(Cl)c3)C2)CC1
: