Target
Fatty acid 2-hydroxylase
Ligand
BDBM483717
Substrate
Meas. Tech.
In Vitro Competitive Activity-Based Protein Profiling
IC50
<100±n/a nM
Citation
 Grice, CAWiener, JJWeber, ODDuncan, KK Pyrazole MAGL inhibitors US Patent  US10927105 Publication Date 2/23/2021 
Target
Name:
Fatty acid 2-hydroxylase
Synonyms:
FA2H FAAH Fatty acid alpha-hydroxylase | Fatty acid hydroxylase domain-containing protein 1
Type:
Protein
Mol. Mass.:
42806.38
Organism:
Human
Description:
Q7L5A8
Residue:
372
  
Inhibitor
Name:
BDBM483717
Synonyms:
1-(trans-5-((2- chlorobenzyl)- (methyl)amino)- octahydrocyclopenta- [c]pyrrole-2- carbonyl)-1H- pyrazole-3- carboxamide US11655217, Example 200
Type:
Small organic molecule
Emp. Form.:
C20H24ClN5O2
Mol. Mass.:
401.89
SMILES:
CN(Cc1ccccc1Cl)[C@@H]1C[C@H]2CN(C[C@H]2C1)C(=O)n1ccc(n1)C(N)=O
: