Target
Monoglyceride lipase
Ligand
BDBM483790
Substrate
Meas. Tech.
In Vitro Competitive Activity-Based Protein Profiling
IC50
<100±n/a nM
Citation
 Grice, CAWiener, JJWeber, ODDuncan, KK Pyrazole MAGL inhibitors US Patent  US10927105 Publication Date 2/23/2021 
Target
Name:
Monoglyceride lipase
Synonyms:
HU-K5 Lysophospholipase-like MGL MGLL_HUMAN
Type:
Hydrolase
Mol. Mass.:
33264.56
Organism:
Homo sapiens (Human)
Description:
Human recombinant MGL (Cayman Chemical, cat# 10008354).
Residue:
303
  
Inhibitor
Name:
BDBM483790
Synonyms:
4-chloro-1-(trans-5- ((3-chloro-5- fluorobenzyl)oxy)- octahydrocyclopenta- [c]pyrrole-2- carbonyl)-1H- pyrazole-3- carboxylic acid US11655217, Example 296
Type:
Small organic molecule
Emp. Form.:
C19H18Cl2FN3O4
Mol. Mass.:
442.268
SMILES:
OC(=O)c1nn(cc1Cl)C(=O)N1C[C@@H]2C[C@H](C[C@@H]2C1)OCc1cc(F)cc(Cl)c1
: